{"text_format":"1","workbook":"xlsx","n_sheets":2,"sheets":["DATOS_ICTS","MAESTROS"],"not_rendered":{"charts":0,"images":0,"macros":1,"external_links":0,"defined_names":2,"comments":0,"pivot_tables":0},"unopened":[],"bounds":{"document_bytes":16777216,"sheet_cells":100000,"rows_first":2000,"rows_last":500,"rows_between":2000,"halvings":0,"cell_chars":16384,"cell_head_chars":4096},"cells_cut":0,"cells_raw":0,"read":"whole","date_system":"1900"}

{"sheet":"DATOS_ICTS","index":0,"n_rows":2185,"n_cols":11,"rows_kept":2185,"cut":false,"hidden":false,"merged":[]}
["ID_TIPO_PUBLICACION","ID_TIPO_ACCESO","TITULO","AUTORES","DOI_URL","DESCRIPCION","ANO_PUBLICACION","TIPO_PUBLICACION","TIPO_ACCESO","PROYECTO","CODIGO_ACCESO"]
[null,null,"Título de la publicación","Autores/as de la publicación. Se ha puesto el IP que figura en del proyecto para identificarlo","Cuando sea posible, y en otro caso una dirección web que apunte a la publicación o resultado en cuestión","Cualquier texto (3000 caracteres) necesario para identificar el trabajo, como la cita completa",null,"Elegir del desplegable","Ya está completo","Ya está completo","Ya está completo"]
[{"$f":"IF(#REF!=\"\",\"\",VLOOKUP(#REF!,MAESTROS!N$2:O$2000,2,FALSE))","v":{"$error":"#REF!"}},{"$f":"IF(#REF!=\"\",\"\",VLOOKUP(#REF!,MAESTROS!P$2:Q$2000,2,FALSE))","v":{"$error":"#REF!"}},"Quantification of particulate matter, tracking the origin and relationship between elements for the environmental monitoring of the Antarctic region. Science of The Total Environment 2019; 665: 125-132.","0000-0002-8581-4972 (Jesús Anzano).  Cáceres JO, Sanz-Mangas D, Manzoor S, Pérez-Arribas LV, Anzano J. ","DOI: 10.1016/j.scitotenv.2019.02.116","Cáceres JO, Sanz-Mangas D, Manzoor S, Pérez-Arribas LV, Anzano J. Quantification of particulate matter, tracking the origin and relationship between elements for the environmental monitoring of the Antarctic region. Science of The Total Environment 2019; 665: 125-132.",2019,"Publicación o presentación en congreso","Acceso por convocatoria","Caracterización de aerosoles atmosféricos en la Antártida","CPE-2018-5"]
[{"$f":"IF(#REF!=\"\",\"\",VLOOKUP(#REF!,MAESTROS!N$2:O$2000,2,FALSE))","v":{"$error":"#REF!"}},{"$f":"IF(#REF!=\"\",\"\",VLOOKUP(#REF!,MAESTROS!P$2:Q$2000,2,FALSE))","v":{"$error":"#REF!"}}," Local and Remote Sources of Airborne Suspended Particulate Matter in the Antarctic Region. Atmosphere 2020; 11.","0000-0002-8581-4972 (Jesús Anzano). Marina-Montes C, Pérez-Arribas LV, Anzano J, Cáceres JO.","https://doi.org/10.3390/atmos11040373","Marina-Montes C, Pérez-Arribas LV, Anzano J, Cáceres JO. Local and Remote Sources of Airborne Suspended Particulate Matter in the Antarctic Region. Atmosphere 2020; 11.",2020,"Publicación o presentación en congreso","Acceso por convocatoria","Caracterización de aerosoles atmosféricos en la Antártida","CPE-2018-5"]
[{"$f":"IF(#REF!=\"\",\"\",VLOOKUP(#REF!,MAESTROS!N$2:O$2000,2,FALSE))","v":{"$error":"#REF!"}},{"$f":"IF(#REF!=\"\",\"\",VLOOKUP(#REF!,MAESTROS!P$2:Q$2000,2,FALSE))","v":{"$error":"#REF!"}}," Heavy metal transport and evolution of atmospheric aerosols in the Antarctic region. Science of The Total Environment 2020; 721: 137702","0000-0002-8581-4972 (Jesús Anzano). Marina-Montes C, Pérez-Arribas LV, Escudero M, Anzano J, Cáceres JO.","https://doi.org/10.1016/j.scitotenv.2020.137702","Marina-Montes C, Pérez-Arribas LV, Escudero M, Anzano J, Cáceres JO. Heavy metal transport and evolution of atmospheric aerosols in the Antarctic region. Science of The Total Environment 2020; 721: 137702.",2020,"Publicación o presentación en congreso","Acceso por convocatoria","Caracterización de aerosoles atmosféricos en la Antártida","CPE-2018-5"]
[{"$f":"IF(#REF!=\"\",\"\",VLOOKUP(#REF!,MAESTROS!N$2:O$2000,2,FALSE))","v":{"$error":"#REF!"}},{"$f":"IF(#REF!=\"\",\"\",VLOOKUP(#REF!,MAESTROS!P$2:Q$2000,2,FALSE))","v":{"$error":"#REF!"}},"“Composition and origin of particulate matter in the Antarctic Region”","0000-0002-8581-4972 (Jesús Anzano). César Marina Montes , Andrés Cruz Conesa , Luis Vicente Pérez Arribas  , Jesús Anzano , Abrahan Velásquez  , Jorge O. Cáceres . \n",null,"César Marina Montes , Andrés Cruz Conesa , Luis Vicente Pérez Arribas  , Jesús Anzano , Abrahan Velásquez  , Jorge O. Cáceres .  1 st International Online Meeting on LIBS. July 6-8, 2020. Oral presentation: “Composition and origin of particulate matter in the Antarctic Region”.",2020,"Publicación o presentación en congreso","Acceso por convocatoria","Caracterización de aerosoles atmosféricos en la Antártida","CPE-2018-5"]
[{"$f":"IF(#REF!=\"\",\"\",VLOOKUP(#REF!,MAESTROS!N$2:O$2000,2,FALSE))","v":{"$error":"#REF!"}},{"$f":"IF(#REF!=\"\",\"\",VLOOKUP(#REF!,MAESTROS!P$2:Q$2000,2,FALSE))","v":{"$error":"#REF!"}},"“Characterization of atmospheric aerosols in the Antarctic Region”.","0000-0002-8581-4972 (Jesús Anzano). César Marina Montes; Jesús Anzano; Jorge O. Cáceres; Luis Vicente Pérez Arribas.\n","https://www.apecs.is/events-archive/events-2020/apecs-international-online-conference-2020.html"," César Marina Montes; Jesús Anzano; Jorge O. Cáceres; Luis Vicente Pérez Arribas. 6th Annual APECS Online Conference. May 20, 2020. Oral presentation: “Characterization of atmospheric aerosols in the Antarctic Region”.",2020,"Publicación o presentación en congreso","Acceso por convocatoria","Caracterización de aerosoles atmosféricos en la Antártida","CPE-2018-5"]
[{"$f":"IF(#REF!=\"\",\"\",VLOOKUP(#REF!,MAESTROS!N$2:O$2000,2,FALSE))","v":{"$error":"#REF!"}},{"$f":"IF(#REF!=\"\",\"\",VLOOKUP(#REF!,MAESTROS!P$2:Q$2000,2,FALSE))","v":{"$error":"#REF!"}},"\"Analysis of soils in the Antarctic Region by calibration free-laser induced breakdown spectroscopy\".","0000-0002-8581-4972 (Jesús Anzano). C. Marina-Montes, R. J. Lasheras, A. Cruz-Conesa, A. Velásquez, J. Anzano, L.V. Pérez-Arribas, J.O. Cáceres, V. Palleschi.",null,"C. Marina-Montes, R. J. Lasheras, A. Cruz-Conesa, A. Velásquez, J. Anzano, L.V. Pérez-Arribas, J.O. Cáceres, V. Palleschi. 11th International Conference on Laser-Induced Breakdown Spectroscopy. September 20-25, 2020, Kyoto Terrsa, Kyoto, JapanLIBS 2020.  Poster presentation: \"Analysis of soils in the Antarctic Region by calibration free-laser induced breakdown spectroscopy\".",2020,"Publicación o presentación en congreso","Acceso por convocatoria","Caracterización de aerosoles atmosféricos en la Antártida","CPE-2018-5"]
[{"$f":"IF(#REF!=\"\",\"\",VLOOKUP(#REF!,MAESTROS!N$2:O$2000,2,FALSE))","v":{"$error":"#REF!"}},{"$f":"IF(#REF!=\"\",\"\",VLOOKUP(#REF!,MAESTROS!P$2:Q$2000,2,FALSE))","v":{"$error":"#REF!"}},"La Antártida, un paraíso para la investigación"," (Jesús Anzano).Jorge Cáceres, César Marina, Luis-Vicente Pérez-Arribas","http://divulgacionciencias.unizar.es/revistas/web/revistas/revista/25","Description of the work carried out in the XXXIII Antarctic campaign.",2020,"Publicación o presentación en congreso","Acceso por convocatoria","Caracterización de aerosoles atmosféricos en la Antártida","CPE-2018-5"]
[{"$f":"IF(#REF!=\"\",\"\",VLOOKUP(#REF!,MAESTROS!N$2:O$2000,2,FALSE))","v":{"$error":"#REF!"}},{"$f":"IF(#REF!=\"\",\"\",VLOOKUP(#REF!,MAESTROS!P$2:Q$2000,2,FALSE))","v":{"$error":"#REF!"}},"Decepción, la Isla del nombre equivocado","Javier del Valle","Armas y Cuerpos Nº 140, pp-89-94 ISSN 2445-0359 ","Deception Islan",2019,"Publicación o presentación en congreso","Acceso por convocatoria","Caracterización de aerosoles atmosféricos en la Antártida","CPE-2018-5"]
[{"$f":"IF(#REF!=\"\",\"\",VLOOKUP(#REF!,MAESTROS!N$2:O$2000,2,FALSE))","v":{"$error":"#REF!"}},{"$f":"IF(#REF!=\"\",\"\",VLOOKUP(#REF!,MAESTROS!P$2:Q$2000,2,FALSE))","v":{"$error":"#REF!"}},"Análisis multielemental de suelo antártico mediante CL-LIBS","0000-0002-8581-4972 (Jesús Anzano).Cruz, Andrés; Martínez Lanciego, Javier; Paulés Ferrer, Daniel; Lasheras , Roberto J.; Velásquez Ferrín,\nAbrahan I.; Pereira Filho, Edenir R.; Cáceres, Jorge O. \n","XXII Reunión de la Sociedad Española de Química Analítica","Exposición del trabajo de laboratorio, Valladolid, Esopaña",2019,"Publicación o presentación en congreso","Acceso por convocatoria","Caracterización de aerosoles atmosféricos en la Antártida","CPE-2018-5"]
[{"$f":"IF(#REF!=\"\",\"\",VLOOKUP(#REF!,MAESTROS!N$2:O$2000,2,FALSE))","v":{"$error":"#REF!"}},{"$f":"IF(#REF!=\"\",\"\",VLOOKUP(#REF!,MAESTROS!P$2:Q$2000,2,FALSE))","v":{"$error":"#REF!"}},"Caracterización de aerosoles en la Isla Decepción (La Antártida)","C. Marina-Montes, R. J. Lasheras, A. Cruz-Conesa, A. Velásquez, J. Anzano, L.V. Pérez-Arribas, J.O. Cáceres, V. Palleschi. 11th International Conference on Laser-Induced Breakdown Spectroscopy. September 20-25, 2020, Kyoto Terrsa, Kyoto, JapanLIBS 2020.  Poster presentation: \"Analysis of soils in the Antarctic Region by calibration free-laser induced breakdown spectroscopy\".","CONAMA","Presentación del trabajo de investigación en muestras antárticas, Madrid, España",2018,"Publicación o presentación en congreso","Acceso por convocatoria","Caracterización de aerosoles atmosféricos en la Antártida","CPE-2018-5"]
[{"$f":"IF(#REF!=\"\",\"\",VLOOKUP(#REF!,MAESTROS!N$2:O$2000,2,FALSE))","v":{"$error":"#REF!"}},{"$f":"IF(#REF!=\"\",\"\",VLOOKUP(#REF!,MAESTROS!P$2:Q$2000,2,FALSE))","v":{"$error":"#REF!"}},"LIBS in the Antartida: Quantification of particulate matter & other interesying proposals in","Jesús Anzano","GRADUATE PROGRAM OF CHEMISTRY","Seminario, S.Carlos, Brasil",2018,"Publicación o presentación en congreso","Acceso por convocatoria","Caracterización de aerosoles atmosféricos en la Antártida","CPE-2018-5"]
[{"$f":"IF(#REF!=\"\",\"\",VLOOKUP(#REF!,MAESTROS!N$2:O$2000,2,FALSE))","v":{"$error":"#REF!"}},{"$f":"IF(#REF!=\"\",\"\",VLOOKUP(#REF!,MAESTROS!P$2:Q$2000,2,FALSE))","v":{"$error":"#REF!"}},"Europe\"·"]
[{"$f":"IF(#REF!=\"\",\"\",VLOOKUP(#REF!,MAESTROS!N$2:O$2000,2,FALSE))","v":{"$error":"#REF!"}},{"$f":"IF(#REF!=\"\",\"\",VLOOKUP(#REF!,MAESTROS!P$2:Q$2000,2,FALSE))","v":{"$error":"#REF!"}}]
[{"$f":"IF(#REF!=\"\",\"\",VLOOKUP(#REF!,MAESTROS!N$2:O$2000,2,FALSE))","v":{"$error":"#REF!"}},{"$f":"IF(#REF!=\"\",\"\",VLOOKUP(#REF!,MAESTROS!P$2:Q$2000,2,FALSE))","v":{"$error":"#REF!"}},"EL LÁSER EN LAS CIENCIAS AMBIENTALES","Jesús Anzano, Mariano Laguna, Miguel Escudero, Javier del Valle, Roberto-Jesús Lasheras, Juan-José\nMonge, Juan de Dios Escolar, Alicia Buceta, Jorge Cáceres, Luis V: Pérez, Francisco Bayo, Alfonso Calvo,\nPaula González-Bladco, Elisa Abas y Oscar Tapia","ESLIBS","Presentación del proyecto caracterización de aerosoles en la Antártida, Málaga, España",2018,"Publicación o presentación en congreso","Acceso por convocatoria","Caracterización de aerosoles atmosféricos en la Antártida","CPE-2018-5"]
[{"$f":"IF(#REF!=\"\",\"\",VLOOKUP(#REF!,MAESTROS!N$2:O$2000,2,FALSE))","v":{"$error":"#REF!"}},{"$f":"IF(#REF!=\"\",\"\",VLOOKUP(#REF!,MAESTROS!P$2:Q$2000,2,FALSE))","v":{"$error":"#REF!"}}]
[{"$f":"IF(#REF!=\"\",\"\",VLOOKUP(#REF!,MAESTROS!N$2:O$2000,2,FALSE))","v":{"$error":"#REF!"}},{"$f":"IF(#REF!=\"\",\"\",VLOOKUP(#REF!,MAESTROS!P$2:Q$2000,2,FALSE))","v":{"$error":"#REF!"}}]
[{"$f":"IF(#REF!=\"\",\"\",VLOOKUP(#REF!,MAESTROS!N$2:O$2000,2,FALSE))","v":{"$error":"#REF!"}},{"$f":"IF(#REF!=\"\",\"\",VLOOKUP(#REF!,MAESTROS!P$2:Q$2000,2,FALSE))","v":{"$error":"#REF!"}}]
[{"$f":"IF(#REF!=\"\",\"\",VLOOKUP(#REF!,MAESTROS!N$2:O$2000,2,FALSE))","v":{"$error":"#REF!"}},{"$f":"IF(#REF!=\"\",\"\",VLOOKUP(#REF!,MAESTROS!P$2:Q$2000,2,FALSE))","v":{"$error":"#REF!"}}]
[{"$f":"IF(#REF!=\"\",\"\",VLOOKUP(#REF!,MAESTROS!N$2:O$2000,2,FALSE))","v":{"$error":"#REF!"}},{"$f":"IF(#REF!=\"\",\"\",VLOOKUP(#REF!,MAESTROS!P$2:Q$2000,2,FALSE))","v":{"$error":"#REF!"}}]
[{"$f":"IF(#REF!=\"\",\"\",VLOOKUP(#REF!,MAESTROS!N$2:O$2000,2,FALSE))","v":{"$error":"#REF!"}},{"$f":"IF(#REF!=\"\",\"\",VLOOKUP(#REF!,MAESTROS!P$2:Q$2000,2,FALSE))","v":{"$error":"#REF!"}}]
[{"$f":"IF(#REF!=\"\",\"\",VLOOKUP(#REF!,MAESTROS!N$2:O$2000,2,FALSE))","v":{"$error":"#REF!"}},{"$f":"IF(#REF!=\"\",\"\",VLOOKUP(#REF!,MAESTROS!P$2:Q$2000,2,FALSE))","v":{"$error":"#REF!"}}]
[{"$f":"IF(#REF!=\"\",\"\",VLOOKUP(#REF!,MAESTROS!N$2:O$2000,2,FALSE))","v":{"$error":"#REF!"}},{"$f":"IF(#REF!=\"\",\"\",VLOOKUP(#REF!,MAESTROS!P$2:Q$2000,2,FALSE))","v":{"$error":"#REF!"}}]
[{"$f":"IF(#REF!=\"\",\"\",VLOOKUP(#REF!,MAESTROS!N$2:O$2000,2,FALSE))","v":{"$error":"#REF!"}},{"$f":"IF(#REF!=\"\",\"\",VLOOKUP(#REF!,MAESTROS!P$2:Q$2000,2,FALSE))","v":{"$error":"#REF!"}}]
[{"$f":"IF(#REF!=\"\",\"\",VLOOKUP(#REF!,MAESTROS!N$2:O$2000,2,FALSE))","v":{"$error":"#REF!"}},{"$f":"IF(#REF!=\"\",\"\",VLOOKUP(#REF!,MAESTROS!P$2:Q$2000,2,FALSE))","v":{"$error":"#REF!"}}]
[{"$f":"IF(#REF!=\"\",\"\",VLOOKUP(#REF!,MAESTROS!N$2:O$2000,2,FALSE))","v":{"$error":"#REF!"}},{"$f":"IF(#REF!=\"\",\"\",VLOOKUP(#REF!,MAESTROS!P$2:Q$2000,2,FALSE))","v":{"$error":"#REF!"}}]
[{"$f":"IF(#REF!=\"\",\"\",VLOOKUP(#REF!,MAESTROS!N$2:O$2000,2,FALSE))","v":{"$error":"#REF!"}},{"$f":"IF(#REF!=\"\",\"\",VLOOKUP(#REF!,MAESTROS!P$2:Q$2000,2,FALSE))","v":{"$error":"#REF!"}}]
[{"$f":"IF(#REF!=\"\",\"\",VLOOKUP(#REF!,MAESTROS!N$2:O$2000,2,FALSE))","v":{"$error":"#REF!"}},{"$f":"IF(#REF!=\"\",\"\",VLOOKUP(#REF!,MAESTROS!P$2:Q$2000,2,FALSE))","v":{"$error":"#REF!"}}]
[{"$f":"IF(#REF!=\"\",\"\",VLOOKUP(#REF!,MAESTROS!N$2:O$2000,2,FALSE))","v":{"$error":"#REF!"}},{"$f":"IF(#REF!=\"\",\"\",VLOOKUP(#REF!,MAESTROS!P$2:Q$2000,2,FALSE))","v":{"$error":"#REF!"}}]
[{"$f":"IF(H8=\"\",\"\",VLOOKUP(H8,MAESTROS!N$2:O$2000,2,FALSE))","v":4},{"$f":"IF(I8=\"\",\"\",VLOOKUP(I8,MAESTROS!P$2:Q$2000,2,FALSE))","v":1}]
[{"$f":"IF(#REF!=\"\",\"\",VLOOKUP(#REF!,MAESTROS!N$2:O$2000,2,FALSE))","v":{"$error":"#REF!"}},{"$f":"IF(#REF!=\"\",\"\",VLOOKUP(#REF!,MAESTROS!P$2:Q$2000,2,FALSE))","v":{"$error":"#REF!"}}]
[{"$f":"IF(#REF!=\"\",\"\",VLOOKUP(#REF!,MAESTROS!N$2:O$2000,2,FALSE))","v":{"$error":"#REF!"}},{"$f":"IF(#REF!=\"\",\"\",VLOOKUP(#REF!,MAESTROS!P$2:Q$2000,2,FALSE))","v":{"$error":"#REF!"}}]
[{"$f":"IF(#REF!=\"\",\"\",VLOOKUP(#REF!,MAESTROS!N$2:O$2000,2,FALSE))","v":{"$error":"#REF!"}},{"$f":"IF(#REF!=\"\",\"\",VLOOKUP(#REF!,MAESTROS!P$2:Q$2000,2,FALSE))","v":{"$error":"#REF!"}}]
[{"$f":"IF(#REF!=\"\",\"\",VLOOKUP(#REF!,MAESTROS!N$2:O$2000,2,FALSE))","v":{"$error":"#REF!"}},{"$f":"IF(#REF!=\"\",\"\",VLOOKUP(#REF!,MAESTROS!P$2:Q$2000,2,FALSE))","v":{"$error":"#REF!"}}]
[{"$f":"IF(#REF!=\"\",\"\",VLOOKUP(#REF!,MAESTROS!N$2:O$2000,2,FALSE))","v":{"$error":"#REF!"}},{"$f":"IF(#REF!=\"\",\"\",VLOOKUP(#REF!,MAESTROS!P$2:Q$2000,2,FALSE))","v":{"$error":"#REF!"}}]
[{"$f":"IF(#REF!=\"\",\"\",VLOOKUP(#REF!,MAESTROS!N$2:O$2000,2,FALSE))","v":{"$error":"#REF!"}},{"$f":"IF(#REF!=\"\",\"\",VLOOKUP(#REF!,MAESTROS!P$2:Q$2000,2,FALSE))","v":{"$error":"#REF!"}}]
[{"$f":"IF(#REF!=\"\",\"\",VLOOKUP(#REF!,MAESTROS!N$2:O$2000,2,FALSE))","v":{"$error":"#REF!"}},{"$f":"IF(#REF!=\"\",\"\",VLOOKUP(#REF!,MAESTROS!P$2:Q$2000,2,FALSE))","v":{"$error":"#REF!"}}]
[{"$f":"IF(#REF!=\"\",\"\",VLOOKUP(#REF!,MAESTROS!N$2:O$2000,2,FALSE))","v":{"$error":"#REF!"}},{"$f":"IF(#REF!=\"\",\"\",VLOOKUP(#REF!,MAESTROS!P$2:Q$2000,2,FALSE))","v":{"$error":"#REF!"}}]
[{"$f":"IF(#REF!=\"\",\"\",VLOOKUP(#REF!,MAESTROS!N$2:O$2000,2,FALSE))","v":{"$error":"#REF!"}},{"$f":"IF(#REF!=\"\",\"\",VLOOKUP(#REF!,MAESTROS!P$2:Q$2000,2,FALSE))","v":{"$error":"#REF!"}}]
[{"$f":"IF(#REF!=\"\",\"\",VLOOKUP(#REF!,MAESTROS!N$2:O$2000,2,FALSE))","v":{"$error":"#REF!"}},{"$f":"IF(#REF!=\"\",\"\",VLOOKUP(#REF!,MAESTROS!P$2:Q$2000,2,FALSE))","v":{"$error":"#REF!"}}]
[{"$f":"IF(H9=\"\",\"\",VLOOKUP(H9,MAESTROS!N$2:O$2000,2,FALSE))","v":4},{"$f":"IF(I9=\"\",\"\",VLOOKUP(I9,MAESTROS!P$2:Q$2000,2,FALSE))","v":1}]
[{"$f":"IF(H10=\"\",\"\",VLOOKUP(H10,MAESTROS!N$2:O$2000,2,FALSE))","v":4},{"$f":"IF(I10=\"\",\"\",VLOOKUP(I10,MAESTROS!P$2:Q$2000,2,FALSE))","v":1}]
[{"$f":"IF(H11=\"\",\"\",VLOOKUP(H11,MAESTROS!N$2:O$2000,2,FALSE))","v":4},{"$f":"IF(I11=\"\",\"\",VLOOKUP(I11,MAESTROS!P$2:Q$2000,2,FALSE))","v":1}]
[{"$f":"IF(H12=\"\",\"\",VLOOKUP(H12,MAESTROS!N$2:O$2000,2,FALSE))","v":4},{"$f":"IF(I12=\"\",\"\",VLOOKUP(I12,MAESTROS!P$2:Q$2000,2,FALSE))","v":1}]
[{"$f":"IF(H13=\"\",\"\",VLOOKUP(H13,MAESTROS!N$2:O$2000,2,FALSE))","v":4},{"$f":"IF(I13=\"\",\"\",VLOOKUP(I13,MAESTROS!P$2:Q$2000,2,FALSE))","v":1}]
[{"$f":"IF(H14=\"\",\"\",VLOOKUP(H14,MAESTROS!N$2:O$2000,2,FALSE))","v":""},{"$f":"IF(I14=\"\",\"\",VLOOKUP(I14,MAESTROS!P$2:Q$2000,2,FALSE))","v":""}]
[{"$f":"IF(H15=\"\",\"\",VLOOKUP(H15,MAESTROS!N$2:O$2000,2,FALSE))","v":""},{"$f":"IF(I15=\"\",\"\",VLOOKUP(I15,MAESTROS!P$2:Q$2000,2,FALSE))","v":""}]
[{"$f":"IF(H16=\"\",\"\",VLOOKUP(H16,MAESTROS!N$2:O$2000,2,FALSE))","v":4},{"$f":"IF(I16=\"\",\"\",VLOOKUP(I16,MAESTROS!P$2:Q$2000,2,FALSE))","v":1}]
[{"$f":"IF(H17=\"\",\"\",VLOOKUP(H17,MAESTROS!N$2:O$2000,2,FALSE))","v":""},{"$f":"IF(I17=\"\",\"\",VLOOKUP(I17,MAESTROS!P$2:Q$2000,2,FALSE))","v":""}]
[{"$f":"IF(H18=\"\",\"\",VLOOKUP(H18,MAESTROS!N$2:O$2000,2,FALSE))","v":""},{"$f":"IF(I18=\"\",\"\",VLOOKUP(I18,MAESTROS!P$2:Q$2000,2,FALSE))","v":""}]
[{"$f":"IF(H19=\"\",\"\",VLOOKUP(H19,MAESTROS!N$2:O$2000,2,FALSE))","v":""},{"$f":"IF(I19=\"\",\"\",VLOOKUP(I19,MAESTROS!P$2:Q$2000,2,FALSE))","v":""}]
[{"$f":"IF(H20=\"\",\"\",VLOOKUP(H20,MAESTROS!N$2:O$2000,2,FALSE))","v":""},{"$f":"IF(I20=\"\",\"\",VLOOKUP(I20,MAESTROS!P$2:Q$2000,2,FALSE))","v":""}]
[{"$f":"IF(H21=\"\",\"\",VLOOKUP(H21,MAESTROS!N$2:O$2000,2,FALSE))","v":""},{"$f":"IF(I21=\"\",\"\",VLOOKUP(I21,MAESTROS!P$2:Q$2000,2,FALSE))","v":""}]
[{"$f":"IF(H22=\"\",\"\",VLOOKUP(H22,MAESTROS!N$2:O$2000,2,FALSE))","v":""},{"$f":"IF(I22=\"\",\"\",VLOOKUP(I22,MAESTROS!P$2:Q$2000,2,FALSE))","v":""}]
[{"$f":"IF(H23=\"\",\"\",VLOOKUP(H23,MAESTROS!N$2:O$2000,2,FALSE))","v":""},{"$f":"IF(I23=\"\",\"\",VLOOKUP(I23,MAESTROS!P$2:Q$2000,2,FALSE))","v":""}]
[{"$f":"IF(H24=\"\",\"\",VLOOKUP(H24,MAESTROS!N$2:O$2000,2,FALSE))","v":""},{"$f":"IF(I24=\"\",\"\",VLOOKUP(I24,MAESTROS!P$2:Q$2000,2,FALSE))","v":""}]
[{"$f":"IF(H25=\"\",\"\",VLOOKUP(H25,MAESTROS!N$2:O$2000,2,FALSE))","v":""},{"$f":"IF(I25=\"\",\"\",VLOOKUP(I25,MAESTROS!P$2:Q$2000,2,FALSE))","v":""}]
[{"$f":"IF(H26=\"\",\"\",VLOOKUP(H26,MAESTROS!N$2:O$2000,2,FALSE))","v":""},{"$f":"IF(I26=\"\",\"\",VLOOKUP(I26,MAESTROS!P$2:Q$2000,2,FALSE))","v":""}]
[{"$f":"IF(H27=\"\",\"\",VLOOKUP(H27,MAESTROS!N$2:O$2000,2,FALSE))","v":""},{"$f":"IF(I27=\"\",\"\",VLOOKUP(I27,MAESTROS!P$2:Q$2000,2,FALSE))","v":""}]
[{"$f":"IF(H28=\"\",\"\",VLOOKUP(H28,MAESTROS!N$2:O$2000,2,FALSE))","v":""},{"$f":"IF(I28=\"\",\"\",VLOOKUP(I28,MAESTROS!P$2:Q$2000,2,FALSE))","v":""}]
[{"$f":"IF(H29=\"\",\"\",VLOOKUP(H29,MAESTROS!N$2:O$2000,2,FALSE))","v":""},{"$f":"IF(I29=\"\",\"\",VLOOKUP(I29,MAESTROS!P$2:Q$2000,2,FALSE))","v":""}]
[{"$f":"IF(H30=\"\",\"\",VLOOKUP(H30,MAESTROS!N$2:O$2000,2,FALSE))","v":""},{"$f":"IF(I30=\"\",\"\",VLOOKUP(I30,MAESTROS!P$2:Q$2000,2,FALSE))","v":""}]
[{"$f":"IF(H31=\"\",\"\",VLOOKUP(H31,MAESTROS!N$2:O$2000,2,FALSE))","v":""},{"$f":"IF(I31=\"\",\"\",VLOOKUP(I31,MAESTROS!P$2:Q$2000,2,FALSE))","v":""}]
[{"$f":"IF(H32=\"\",\"\",VLOOKUP(H32,MAESTROS!N$2:O$2000,2,FALSE))","v":""},{"$f":"IF(I32=\"\",\"\",VLOOKUP(I32,MAESTROS!P$2:Q$2000,2,FALSE))","v":""}]
[{"$f":"IF(H33=\"\",\"\",VLOOKUP(H33,MAESTROS!N$2:O$2000,2,FALSE))","v":""},{"$f":"IF(I33=\"\",\"\",VLOOKUP(I33,MAESTROS!P$2:Q$2000,2,FALSE))","v":""}]
[{"$f":"IF(H34=\"\",\"\",VLOOKUP(H34,MAESTROS!N$2:O$2000,2,FALSE))","v":""},{"$f":"IF(I34=\"\",\"\",VLOOKUP(I34,MAESTROS!P$2:Q$2000,2,FALSE))","v":""}]
[{"$f":"IF(H35=\"\",\"\",VLOOKUP(H35,MAESTROS!N$2:O$2000,2,FALSE))","v":""},{"$f":"IF(I35=\"\",\"\",VLOOKUP(I35,MAESTROS!P$2:Q$2000,2,FALSE))","v":""}]
[{"$f":"IF(H36=\"\",\"\",VLOOKUP(H36,MAESTROS!N$2:O$2000,2,FALSE))","v":""},{"$f":"IF(I36=\"\",\"\",VLOOKUP(I36,MAESTROS!P$2:Q$2000,2,FALSE))","v":""}]
[{"$f":"IF(H37=\"\",\"\",VLOOKUP(H37,MAESTROS!N$2:O$2000,2,FALSE))","v":""},{"$f":"IF(I37=\"\",\"\",VLOOKUP(I37,MAESTROS!P$2:Q$2000,2,FALSE))","v":""}]
[{"$f":"IF(H38=\"\",\"\",VLOOKUP(H38,MAESTROS!N$2:O$2000,2,FALSE))","v":""},{"$f":"IF(I38=\"\",\"\",VLOOKUP(I38,MAESTROS!P$2:Q$2000,2,FALSE))","v":""}]
[{"$f":"IF(H39=\"\",\"\",VLOOKUP(H39,MAESTROS!N$2:O$2000,2,FALSE))","v":""},{"$f":"IF(I39=\"\",\"\",VLOOKUP(I39,MAESTROS!P$2:Q$2000,2,FALSE))","v":""}]
[{"$f":"IF(H40=\"\",\"\",VLOOKUP(H40,MAESTROS!N$2:O$2000,2,FALSE))","v":""},{"$f":"IF(I40=\"\",\"\",VLOOKUP(I40,MAESTROS!P$2:Q$2000,2,FALSE))","v":""}]
[{"$f":"IF(H41=\"\",\"\",VLOOKUP(H41,MAESTROS!N$2:O$2000,2,FALSE))","v":""},{"$f":"IF(I41=\"\",\"\",VLOOKUP(I41,MAESTROS!P$2:Q$2000,2,FALSE))","v":""}]
[{"$f":"IF(H42=\"\",\"\",VLOOKUP(H42,MAESTROS!N$2:O$2000,2,FALSE))","v":""},{"$f":"IF(I42=\"\",\"\",VLOOKUP(I42,MAESTROS!P$2:Q$2000,2,FALSE))","v":""}]
[{"$f":"IF(H43=\"\",\"\",VLOOKUP(H43,MAESTROS!N$2:O$2000,2,FALSE))","v":""},{"$f":"IF(I43=\"\",\"\",VLOOKUP(I43,MAESTROS!P$2:Q$2000,2,FALSE))","v":""}]
[{"$f":"IF(H44=\"\",\"\",VLOOKUP(H44,MAESTROS!N$2:O$2000,2,FALSE))","v":""},{"$f":"IF(I44=\"\",\"\",VLOOKUP(I44,MAESTROS!P$2:Q$2000,2,FALSE))","v":""}]
[{"$f":"IF(H45=\"\",\"\",VLOOKUP(H45,MAESTROS!N$2:O$2000,2,FALSE))","v":""},{"$f":"IF(I45=\"\",\"\",VLOOKUP(I45,MAESTROS!P$2:Q$2000,2,FALSE))","v":""}]
[{"$f":"IF(H46=\"\",\"\",VLOOKUP(H46,MAESTROS!N$2:O$2000,2,FALSE))","v":""},{"$f":"IF(I46=\"\",\"\",VLOOKUP(I46,MAESTROS!P$2:Q$2000,2,FALSE))","v":""}]
[{"$f":"IF(H47=\"\",\"\",VLOOKUP(H47,MAESTROS!N$2:O$2000,2,FALSE))","v":""},{"$f":"IF(I47=\"\",\"\",VLOOKUP(I47,MAESTROS!P$2:Q$2000,2,FALSE))","v":""}]
{"$rows_left_out":2106}
{"sheet":"MAESTROS","index":1,"n_rows":7,"n_cols":17,"rows_kept":7,"cut":false,"hidden":true,"merged":[]}
[null,null,null,null,null,null,null,null,null,null,null,null,null,"TIPO_PUBLICACION","ID_TIPO_PUBLICACION","TIPO_ACCESO","ID_TIPO_ACCESO"]
[null,null,null,null,null,null,null,null,null,null,null,null,null,"Libro",1,"Acceso por convocatoria",1]
[null,null,null,null,null,null,null,null,null,null,null,null,null,"Artículo o capítulo de libro",2,"Acceso bajo demanda",2]
[null,null,null,null,null,null,null,null,null,null,null,null,null,"Informe técnico",3]
[null,null,null,null,null,null,null,null,null,null,null,null,null,"Publicación o presentación en congreso",4]
[null,null,null,null,null,null,null,null,null,null,null,null,null,"Conjunto de datos",5]
[null,null,null,null,null,null,null,null,null,null,null,null,null,"Otros",6]